-
Notifications
You must be signed in to change notification settings - Fork 0
Expand file tree
/
Copy pathdlib_log.txt
More file actions
262 lines (253 loc) · 18.8 KB
/
Copy pathdlib_log.txt
File metadata and controls
262 lines (253 loc) · 18.8 KB
1
2
3
4
5
6
7
8
9
10
11
12
13
14
15
16
17
18
19
20
21
22
23
24
25
26
27
28
29
30
31
32
33
34
35
36
37
38
39
40
41
42
43
44
45
46
47
48
49
50
51
52
53
54
55
56
57
58
59
60
61
62
63
64
65
66
67
68
69
70
71
72
73
74
75
76
77
78
79
80
81
82
83
84
85
86
87
88
89
90
91
92
93
94
95
96
97
98
99
100
101
102
103
104
105
106
107
108
109
110
111
112
113
114
115
116
117
118
119
120
121
122
123
124
125
126
127
128
129
130
131
132
133
134
135
136
137
138
139
140
141
142
143
144
145
146
147
148
149
150
151
152
153
154
155
156
157
158
159
160
161
162
163
164
165
166
167
168
169
170
171
172
173
174
175
176
177
178
179
180
181
182
183
184
185
186
187
188
189
190
191
192
193
194
195
196
197
198
199
200
201
202
203
204
205
206
207
208
209
210
211
212
213
214
215
216
217
218
219
220
221
222
223
224
225
226
227
228
229
230
231
232
233
234
235
236
237
238
239
240
241
242
243
244
245
246
247
248
249
250
251
252
253
254
255
256
257
258
259
260
261
262
Collecting dlib
Using cached dlib-20.0.1.tar.gz (3.3 MB)
Installing build dependencies: started
Installing build dependencies: finished with status 'done'
Getting requirements to build wheel: started
Getting requirements to build wheel: finished with status 'done'
Preparing metadata (pyproject.toml): started
Preparing metadata (pyproject.toml): finished with status 'done'
Building wheels for collected packages: dlib
Building wheel for dlib (pyproject.toml): started
Building wheel for dlib (pyproject.toml): finished with status 'error'
error: subprocess-exited-with-error
× Building wheel for dlib (pyproject.toml) did not run successfully.
│ exit code: 1
╰─> [237 lines of output]
INFO:root:running bdist_wheel
INFO:root:running build
INFO:root:running build_ext
Building extension for Python 3.14.6 (main, Jun 10 2026, 10:03:53) [Clang 21.0.0 (clang-2100.0.123.102)]
Invoking CMake setup: 'cmake /private/var/folders/mp/2lrl1cv121d49h1cy0v8zb2r0000gn/T/pip-install-wfuxm0de/dlib_fdbeb126badf44c880adb42aacfb5030/tools/python -DCMAKE_LIBRARY_OUTPUT_DIRECTORY=/private/var/folders/mp/2lrl1cv121d49h1cy0v8zb2r0000gn/T/pip-install-wfuxm0de/dlib_fdbeb126badf44c880adb42aacfb5030/build/lib.macosx-26.0-arm64-cpython-314 -DDLIB_USE_FFMPEG=OFF -DPYTHON_EXECUTABLE=/Users/devi/Desktop/EdgeAI/faceenv/bin/python3.14 -DCMAKE_BUILD_TYPE=Release'
-- The C compiler identification is AppleClang 21.0.0.21000101
-- The CXX compiler identification is AppleClang 21.0.0.21000101
-- Detecting C compiler ABI info
-- Detecting C compiler ABI info - done
-- Check for working C compiler: /usr/bin/cc - skipped
-- Detecting C compile features
-- Detecting C compile features - done
-- Detecting CXX compiler ABI info
-- Detecting CXX compiler ABI info - done
-- Check for working CXX compiler: /usr/bin/c++ - skipped
-- Detecting CXX compile features
-- Detecting CXX compile features - done
CMake Deprecation Warning at /private/var/folders/mp/2lrl1cv121d49h1cy0v8zb2r0000gn/T/pip-install-wfuxm0de/dlib_fdbeb126badf44c880adb42aacfb5030/dlib/external/pybind11/CMakeLists.txt:13 (cmake_minimum_required):
Compatibility with CMake < 3.10 will be removed from a future version of
CMake.
Update the VERSION argument <min> value. Or, use the <min>...<max> syntax
to tell CMake that the project requires at least <min> but has been updated
to work with policies introduced by <max> or earlier.
-- pybind11 v2.12.0
CMake Deprecation Warning at /private/var/folders/mp/2lrl1cv121d49h1cy0v8zb2r0000gn/T/pip-install-wfuxm0de/dlib_fdbeb126badf44c880adb42aacfb5030/dlib/external/pybind11/tools/FindPythonLibsNew.cmake:110 (cmake_policy):
The OLD behavior for policy CMP0148 will be removed from a future version
of CMake.
The cmake-policies(7) manual explains that the OLD behaviors of all
policies are deprecated and that a policy should be set to OLD only under
specific short-term circumstances. Projects should be ported to the NEW
behavior and not rely on setting a policy to OLD.
Call Stack (most recent call first):
/private/var/folders/mp/2lrl1cv121d49h1cy0v8zb2r0000gn/T/pip-install-wfuxm0de/dlib_fdbeb126badf44c880adb42aacfb5030/dlib/external/pybind11/tools/pybind11Tools.cmake:50 (find_package)
/private/var/folders/mp/2lrl1cv121d49h1cy0v8zb2r0000gn/T/pip-install-wfuxm0de/dlib_fdbeb126badf44c880adb42aacfb5030/dlib/external/pybind11/tools/pybind11Common.cmake:192 (include)
/private/var/folders/mp/2lrl1cv121d49h1cy0v8zb2r0000gn/T/pip-install-wfuxm0de/dlib_fdbeb126badf44c880adb42aacfb5030/dlib/external/pybind11/CMakeLists.txt:247 (include)
-- Found PythonInterp: /Users/devi/Desktop/EdgeAI/faceenv/bin/python3.14 (found suitable version "3.14.6", minimum required is "3.6")
-- Found PythonLibs: /opt/homebrew/opt/python@3.14/Frameworks/Python.framework/Versions/3.14/lib/libpython3.14.dylib
-- Performing Test HAS_FLTO_THIN
-- Performing Test HAS_FLTO_THIN - Failed
-- Performing Test HAS_FLTO
-- Performing Test HAS_FLTO - Success
-- Using CMake version: 4.3.4
-- Compiling dlib version: 20.0.1
-- __ARM_NEON__ defined.
-- Performing Test CMAKE_HAVE_LIBC_PTHREAD
-- Performing Test CMAKE_HAVE_LIBC_PTHREAD - Success
-- Found Threads: TRUE
*****************************************************************************
*** DLIB GUI SUPPORT DISABLED BECAUSE X11 DEVELOPMENT LIBRARIES NOT FOUND ***
*** Make sure XQuartz is installed if you want GUI support. ***
*** You can download XQuartz from: https://www.xquartz.org/ ***
*****************************************************************************
-- NEON instructions will be used for libpng.
-- The ASM compiler identification is AppleClang
-- Found assembler: /usr/bin/cc
-- Searching for JPEG XL
-- Could NOT find PkgConfig (missing: PKG_CONFIG_EXECUTABLE)
-- PkgConfig could not be found, JPEG XL support won't be available
-- Searching for BLAS and LAPACK
-- Searching for BLAS and LAPACK
-- Could NOT find PkgConfig (missing: PKG_CONFIG_EXECUTABLE)
-- Looking for cblas_ddot
-- Looking for cblas_ddot - not found
-- Looking for sys/types.h
-- Looking for sys/types.h - found
-- Looking for stdint.h
-- Looking for stdint.h - found
-- Looking for stddef.h
-- Looking for stddef.h - found
-- Check size of void*
-- Check size of void* - done
-- Found LAPACK library
-- Found CBLAS library
-- Looking for cblas_ddot
-- Looking for cblas_ddot - found
-- Looking for sgesv
-- Looking for sgesv - found
-- Looking for sgesv_
-- Looking for sgesv_ - found
-- Could not find `nvcc` executable in any searched paths, please set CUDAToolkit_ROOT
-- DID NOT FIND CUDA
-- Disabling CUDA support for dlib. DLIB WILL NOT USE CUDA
-- Configuring done (2.8s)
-- Generating done (0.0s)
-- Build files have been written to: /private/var/folders/mp/2lrl1cv121d49h1cy0v8zb2r0000gn/T/pip-install-wfuxm0de/dlib_fdbeb126badf44c880adb42aacfb5030/build/temp.macosx-26.0-arm64-cpython-314
Invoking CMake build: 'cmake --build . --config Release -- -j8'
[ 1%] Building CXX object dlib_build/CMakeFiles/dlib.dir/base64/base64_kernel_1.cpp.o
[ 1%] Building CXX object dlib_build/CMakeFiles/dlib.dir/bigint/bigint_kernel_1.cpp.o
[ 2%] Building CXX object dlib_build/CMakeFiles/dlib.dir/bigint/bigint_kernel_2.cpp.o
[ 3%] Building CXX object dlib_build/CMakeFiles/dlib.dir/entropy_decoder/entropy_decoder_kernel_1.cpp.o
[ 4%] Building CXX object dlib_build/CMakeFiles/dlib.dir/entropy_decoder/entropy_decoder_kernel_2.cpp.o
[ 4%] Building CXX object dlib_build/CMakeFiles/dlib.dir/bit_stream/bit_stream_kernel_1.cpp.o
[ 5%] Building CXX object dlib_build/CMakeFiles/dlib.dir/entropy_encoder/entropy_encoder_kernel_2.cpp.o
[ 5%] Building CXX object dlib_build/CMakeFiles/dlib.dir/entropy_encoder/entropy_encoder_kernel_1.cpp.o
[ 6%] Building CXX object dlib_build/CMakeFiles/dlib.dir/md5/md5_kernel_1.cpp.o
[ 6%] Building CXX object dlib_build/CMakeFiles/dlib.dir/tokenizer/tokenizer_kernel_1.cpp.o
[ 7%] Building CXX object dlib_build/CMakeFiles/dlib.dir/unicode/unicode.cpp.o
[ 8%] Building CXX object dlib_build/CMakeFiles/dlib.dir/test_for_odr_violations.cpp.o
[ 8%] Building CXX object dlib_build/CMakeFiles/dlib.dir/fft/fft.cpp.o
[ 9%] Building CXX object dlib_build/CMakeFiles/dlib.dir/sockets/sockets_kernel_1.cpp.o
[ 9%] Building CXX object dlib_build/CMakeFiles/dlib.dir/bsp/bsp.cpp.o
[ 10%] Building CXX object dlib_build/CMakeFiles/dlib.dir/dir_nav/dir_nav_kernel_1.cpp.o
[ 10%] Building CXX object dlib_build/CMakeFiles/dlib.dir/dir_nav/dir_nav_extensions.cpp.o
[ 11%] Building CXX object dlib_build/CMakeFiles/dlib.dir/dir_nav/dir_nav_kernel_2.cpp.o
[ 12%] Building CXX object dlib_build/CMakeFiles/dlib.dir/gui_widgets/fonts.cpp.o
[ 12%] Building CXX object dlib_build/CMakeFiles/dlib.dir/logger/extra_logger_headers.cpp.o
[ 13%] Building CXX object dlib_build/CMakeFiles/dlib.dir/linker/linker_kernel_1.cpp.o
[ 14%] Building CXX object dlib_build/CMakeFiles/dlib.dir/logger/logger_kernel_1.cpp.o
[ 15%] Building CXX object dlib_build/CMakeFiles/dlib.dir/logger/logger_config_file.cpp.o
[ 15%] Building CXX object dlib_build/CMakeFiles/dlib.dir/misc_api/misc_api_kernel_1.cpp.o
[ 16%] Building CXX object dlib_build/CMakeFiles/dlib.dir/misc_api/misc_api_kernel_2.cpp.o
[ 16%] Building CXX object dlib_build/CMakeFiles/dlib.dir/sockets/sockets_extensions.cpp.o
[ 17%] Building CXX object dlib_build/CMakeFiles/dlib.dir/sockets/sockets_kernel_2.cpp.o
[ 18%] Building CXX object dlib_build/CMakeFiles/dlib.dir/sockstreambuf/sockstreambuf.cpp.o
[ 18%] Building CXX object dlib_build/CMakeFiles/dlib.dir/sockstreambuf/sockstreambuf_unbuffered.cpp.o
[ 19%] Building CXX object dlib_build/CMakeFiles/dlib.dir/server/server_kernel.cpp.o
[ 20%] Building CXX object dlib_build/CMakeFiles/dlib.dir/server/server_iostream.cpp.o
[ 20%] Building CXX object dlib_build/CMakeFiles/dlib.dir/server/server_http.cpp.o
[ 21%] Building CXX object dlib_build/CMakeFiles/dlib.dir/threads/multithreaded_object_extension.cpp.o
[ 21%] Building CXX object dlib_build/CMakeFiles/dlib.dir/threads/threaded_object_extension.cpp.o
[ 22%] Building CXX object dlib_build/CMakeFiles/dlib.dir/threads/threads_kernel_1.cpp.o
[ 23%] Building CXX object dlib_build/CMakeFiles/dlib.dir/threads/threads_kernel_2.cpp.o
[ 23%] Building CXX object dlib_build/CMakeFiles/dlib.dir/threads/threads_kernel_shared.cpp.o
[ 24%] Building CXX object dlib_build/CMakeFiles/dlib.dir/threads/thread_pool_extension.cpp.o
[ 25%] Building CXX object dlib_build/CMakeFiles/dlib.dir/threads/async.cpp.o
[ 25%] Building CXX object dlib_build/CMakeFiles/dlib.dir/timer/timer.cpp.o
[ 26%] Building CXX object dlib_build/CMakeFiles/dlib.dir/stack_trace.cpp.o
[ 27%] Building CXX object dlib_build/CMakeFiles/dlib.dir/cuda/cpu_dlib.cpp.o
[ 27%] Building CXX object dlib_build/CMakeFiles/dlib.dir/cuda/tensor_tools.cpp.o
[ 28%] Building CXX object dlib_build/CMakeFiles/dlib.dir/data_io/image_dataset_metadata.cpp.o
[ 28%] Building CXX object dlib_build/CMakeFiles/dlib.dir/data_io/mnist.cpp.o
[ 29%] Building CXX object dlib_build/CMakeFiles/dlib.dir/data_io/cifar.cpp.o
[ 30%] Building CXX object dlib_build/CMakeFiles/dlib.dir/global_optimization/global_function_search.cpp.o
[ 30%] Building CXX object dlib_build/CMakeFiles/dlib.dir/filtering/kalman_filter.cpp.o
[ 31%] Building CXX object dlib_build/CMakeFiles/dlib.dir/svm/auto.cpp.o
[ 32%] Building C object dlib_build/CMakeFiles/dlib.dir/external/libpng/arm/arm_init.c.o
[ 32%] Building C object dlib_build/CMakeFiles/dlib.dir/external/libpng/arm/filter_neon_intrinsics.c.o
In file included from /private/var/folders/mp/2lrl1cv121d49h1cy0v8zb2r0000gn/T/pip-install-wfuxm0de/dlib_fdbeb126badf44c880adb42aacfb5030/dlib/external/libpng/arm/arm_init.c:17:
/private/var/folders/mp/2lrl1cv121d49h1cy0v8zb2r0000gn/T/pip-install-wfuxm0de/dlib_fdbeb126badf44c880adb42aacfb5030/dlib/external/libpng/arm/../pngpriv.h:527:16: fatal error: 'fp.h' file not found
527 | # include <fp.h>
| ^~~~~~
1 error generated.
make[2]: *** [dlib_build/CMakeFiles/dlib.dir/external/libpng/arm/arm_init.c.o] Error 1
make[2]: *** Waiting for unfinished jobs....
In file included from /private/var/folders/mp/2lrl1cv121d49h1cy0v8zb2r0000gn/T/pip-install-wfuxm0de/dlib_fdbeb126badf44c880adb42aacfb5030/dlib/external/libpng/arm/filter_neon_intrinsics.c:15:
/private/var/folders/mp/2lrl1cv121d49h1cy0v8zb2r0000gn/T/pip-install-wfuxm0de/dlib_fdbeb126badf44c880adb42aacfb5030/dlib/external/libpng/arm/../pngpriv.h:527:16: fatal error: 'fp.h' file not found
527 | # include <fp.h>
| ^~~~~~
1 error generated.
make[2]: *** [dlib_build/CMakeFiles/dlib.dir/external/libpng/arm/filter_neon_intrinsics.c.o] Error 1
make[1]: *** [dlib_build/CMakeFiles/dlib.dir/all] Error 2
make: *** [all] Error 2
Traceback (most recent call last):
File "/Users/devi/Desktop/EdgeAI/faceenv/lib/python3.14/site-packages/pip/_vendor/pyproject_hooks/_in_process/_in_process.py", line 389, in <module>
main()
~~~~^^
File "/Users/devi/Desktop/EdgeAI/faceenv/lib/python3.14/site-packages/pip/_vendor/pyproject_hooks/_in_process/_in_process.py", line 373, in main
json_out["return_val"] = hook(**hook_input["kwargs"])
~~~~^^^^^^^^^^^^^^^^^^^^^^^^
File "/Users/devi/Desktop/EdgeAI/faceenv/lib/python3.14/site-packages/pip/_vendor/pyproject_hooks/_in_process/_in_process.py", line 280, in build_wheel
return _build_backend().build_wheel(
~~~~~~~~~~~~~~~~~~~~~~~~~~~~^
wheel_directory, config_settings, metadata_directory
^^^^^^^^^^^^^^^^^^^^^^^^^^^^^^^^^^^^^^^^^^^^^^^^^^^^
)
^
File "/private/var/folders/mp/2lrl1cv121d49h1cy0v8zb2r0000gn/T/pip-build-env-gz__zte7/overlay/lib/python3.14/site-packages/setuptools/build_meta.py", line 441, in build_wheel
return _build(['bdist_wheel', '--dist-info-dir', str(metadata_directory)])
File "/private/var/folders/mp/2lrl1cv121d49h1cy0v8zb2r0000gn/T/pip-build-env-gz__zte7/overlay/lib/python3.14/site-packages/setuptools/build_meta.py", line 429, in _build
return self._build_with_temp_dir(
~~~~~~~~~~~~~~~~~~~~~~~~~^
cmd,
^^^^
...<3 lines>...
self._arbitrary_args(config_settings),
^^^^^^^^^^^^^^^^^^^^^^^^^^^^^^^^^^^^^^
)
^
File "/private/var/folders/mp/2lrl1cv121d49h1cy0v8zb2r0000gn/T/pip-build-env-gz__zte7/overlay/lib/python3.14/site-packages/setuptools/build_meta.py", line 410, in _build_with_temp_dir
self.run_setup()
~~~~~~~~~~~~~~^^
File "/private/var/folders/mp/2lrl1cv121d49h1cy0v8zb2r0000gn/T/pip-build-env-gz__zte7/overlay/lib/python3.14/site-packages/setuptools/build_meta.py", line 317, in run_setup
exec(code, locals())
~~~~^^^^^^^^^^^^^^^^
File "<string>", line 247, in <module>
File "/private/var/folders/mp/2lrl1cv121d49h1cy0v8zb2r0000gn/T/pip-build-env-gz__zte7/overlay/lib/python3.14/site-packages/setuptools/__init__.py", line 117, in setup
return distutils.core.setup(**attrs) # type: ignore[return-value]
~~~~~~~~~~~~~~~~~~~~^^^^^^^^^
File "/private/var/folders/mp/2lrl1cv121d49h1cy0v8zb2r0000gn/T/pip-build-env-gz__zte7/overlay/lib/python3.14/site-packages/setuptools/_distutils/core.py", line 186, in setup
return run_commands(dist)
File "/private/var/folders/mp/2lrl1cv121d49h1cy0v8zb2r0000gn/T/pip-build-env-gz__zte7/overlay/lib/python3.14/site-packages/setuptools/_distutils/core.py", line 202, in run_commands
dist.run_commands()
~~~~~~~~~~~~~~~~~^^
File "/private/var/folders/mp/2lrl1cv121d49h1cy0v8zb2r0000gn/T/pip-build-env-gz__zte7/overlay/lib/python3.14/site-packages/setuptools/_distutils/dist.py", line 1000, in run_commands
self.run_command(cmd)
~~~~~~~~~~~~~~~~^^^^^
File "/private/var/folders/mp/2lrl1cv121d49h1cy0v8zb2r0000gn/T/pip-build-env-gz__zte7/overlay/lib/python3.14/site-packages/setuptools/dist.py", line 1107, in run_command
super().run_command(command)
~~~~~~~~~~~~~~~~~~~^^^^^^^^^
File "/private/var/folders/mp/2lrl1cv121d49h1cy0v8zb2r0000gn/T/pip-build-env-gz__zte7/overlay/lib/python3.14/site-packages/setuptools/_distutils/dist.py", line 1019, in run_command
cmd_obj.run()
~~~~~~~~~~~^^
File "/private/var/folders/mp/2lrl1cv121d49h1cy0v8zb2r0000gn/T/pip-build-env-gz__zte7/overlay/lib/python3.14/site-packages/setuptools/command/bdist_wheel.py", line 370, in run
self.run_command("build")
~~~~~~~~~~~~~~~~^^^^^^^^^
File "/private/var/folders/mp/2lrl1cv121d49h1cy0v8zb2r0000gn/T/pip-build-env-gz__zte7/overlay/lib/python3.14/site-packages/setuptools/_distutils/cmd.py", line 341, in run_command
self.distribution.run_command(command)
~~~~~~~~~~~~~~~~~~~~~~~~~~~~~^^^^^^^^^
File "/private/var/folders/mp/2lrl1cv121d49h1cy0v8zb2r0000gn/T/pip-build-env-gz__zte7/overlay/lib/python3.14/site-packages/setuptools/dist.py", line 1107, in run_command
super().run_command(command)
~~~~~~~~~~~~~~~~~~~^^^^^^^^^
File "/private/var/folders/mp/2lrl1cv121d49h1cy0v8zb2r0000gn/T/pip-build-env-gz__zte7/overlay/lib/python3.14/site-packages/setuptools/_distutils/dist.py", line 1019, in run_command
cmd_obj.run()
~~~~~~~~~~~^^
File "/private/var/folders/mp/2lrl1cv121d49h1cy0v8zb2r0000gn/T/pip-build-env-gz__zte7/overlay/lib/python3.14/site-packages/setuptools/_distutils/command/build.py", line 135, in run
self.run_command(cmd_name)
~~~~~~~~~~~~~~~~^^^^^^^^^^
File "/private/var/folders/mp/2lrl1cv121d49h1cy0v8zb2r0000gn/T/pip-build-env-gz__zte7/overlay/lib/python3.14/site-packages/setuptools/_distutils/cmd.py", line 341, in run_command
self.distribution.run_command(command)
~~~~~~~~~~~~~~~~~~~~~~~~~~~~~^^^^^^^^^
File "/private/var/folders/mp/2lrl1cv121d49h1cy0v8zb2r0000gn/T/pip-build-env-gz__zte7/overlay/lib/python3.14/site-packages/setuptools/dist.py", line 1107, in run_command
super().run_command(command)
~~~~~~~~~~~~~~~~~~~^^^^^^^^^
File "/private/var/folders/mp/2lrl1cv121d49h1cy0v8zb2r0000gn/T/pip-build-env-gz__zte7/overlay/lib/python3.14/site-packages/setuptools/_distutils/dist.py", line 1019, in run_command
cmd_obj.run()
~~~~~~~~~~~^^
File "<string>", line 170, in run
File "<string>", line 217, in build_extension
File "/opt/homebrew/Cellar/python@3.14/3.14.6/Frameworks/Python.framework/Versions/3.14/lib/python3.14/subprocess.py", line 420, in check_call
raise CalledProcessError(retcode, cmd)
subprocess.CalledProcessError: Command '['cmake', '--build', '.', '--config', 'Release', '--', '-j8']' returned non-zero exit status 2.
[end of output]
note: This error originates from a subprocess, and is likely not a problem with pip.
ERROR: Failed building wheel for dlib
Failed to build dlib
error: failed-wheel-build-for-install
× Failed to build installable wheels for some pyproject.toml based projects
╰─> dlib